R12.2.0 post install checks error : RW-50016: Error: - {0} was not created - 1

:A. R 12. 1. 1: Fresh Install Rapidwiz POST Install check is failing for several checks with error RW-50016: Error: - was not ...
来自: 开发者社区 > 博客 作者: 机器的心脏 浏览:7 回复:0

mysql之 [ERROR] InnoDB: Unable to lock ./ibdata1, error: 11

null问题描述:启动MySQL后,出现连接不上,报 [ ERROR] InnoDB: Unable to lock ./ibdata 1, error: 11[root@mysql01 ~]# service mysql startStarting ...
来自: 开发者社区 > 博客 作者: 技术小美 浏览:10 回复:0
推荐

阿里云高校特惠,助力学生创业梦!0元体验,快速入门云计算!

建个炫酷的简历网页,制作一个浪漫的表白网页,打造个人专属网盘,多种动手场景应用免费学!!!
广告

请问目前「大数据开发套件」添加调度资源时只能使用「华东2」的 ECS 吗?在华南的 ECS 在安装后会心跳日志是这样的: 2017-06-08 19:08:10,633 ERROR [pool-6

请问目前「大数据开发套件」添加调度资源时只能使用「华东2」的 ECS 吗?在华南的 ECS 在安装后会心跳日志是这样的:2017-06-08 19:08:10,633 ERROR [pool-6-thread- 1 ...
来自: 开发者社区 > 问答 作者: 祁同伟 浏览:275 回复:1

); //超时时间为1小时 但是在实际的使用中发现很短时间后就会退出,通过查看 error log,发现:’RedisException’ with message ‘read error on connection’ 提示。

一个后台常驻 job 通过 redis 的 brpop 阻塞读取消息时,设置的超时时间较长。list($key,$row)=$redis->brPop($queue_name,3600); //超时时间为 1小时但是在实际的使用中发现很短时间 ...
来自: 开发者社区 > 问答 作者: 行者武松 浏览:13 回复:0

Last_SQL_Error: Error 'Duplicate entry '1' for key 'PRIMARY''

[size=small]-实际遇到的问题:&Last_SQL_ Error: Error 'Duplicate entry ' 1' for key 'PRIMARY'' on query ...
来自: 开发者社区 > 博客 作者: 转身泪倾城 浏览:1033 回复:0

IDEA里运行代码时出现Error:scalac: error while loading JUnit4, Scala signature JUnit4 has wrong version expected: 5.0 found: 4.1 in JUnit4.class错误的解决办法(图文详解)

3s 910ms Error:scalac: error while loading JUnit4, Scala signature JUnit4 has wrong version expected: 5.0 found: 4. 1 in ...
来自: 开发者社区 > 博客 作者: 技术小哥哥 浏览:7 回复:0

IDEA里运行代码时出现Error:scalac: error while loading JUnit4, Scala signature JUnit4 has wrong version expected: 5.0 found: 4.1 in JUnit4.class错误的解决办法(图文详解)

3s 910ms Error:scalac: error while loading JUnit4, Scala signature JUnit4 has wrong version expected: 5.0 found: 4. 1 in ...
来自: 开发者社区 > 博客 作者: 技术小哥哥 浏览:8 回复:0

ERROR : Error appeared during Puppet run: 192.168.1.201_mariadb.pp

nullRDO模式安装报错 123 ERROR&:& Error&appeared&during&Puppet&run:&192.168. 1.201 ...
来自: 开发者社区 > 博客 作者: 余二五 浏览:7 回复:0

【我的Android进阶之旅】解决 Error:CreateProcess error=216, 该版本的 %1 与您运行的 Windows 版本不兼容。请查看计算机的系统信息,了解是否需要 x86

一、错误描述刚刚打开Android Studio新建一个项目,然后就编译不了,报了如下所示的错误:错误描述为: Error:CreateProcess error=216, 该版本的 % 1 与您运行 ...
来自: 开发者社区 > 博客 作者: 欧阳鹏 浏览:55 回复:0

安装XenApp 6 Error:exited with error code -1

。思路转变:问题应该出在软件本身,有某种环境把他给激发出来了。在事件查看器中也没有找到具体错误信息。思路 1、不使用Autorun进行安装。顺利安装了Web Interface和License Server当安装XenApp时,提示必须使用光盘里 ...
来自: 开发者社区 > 博客 作者: 技术小牛人 浏览:2 回复:0

求助:ERROR 1030 (HY000): Got error -1 from storage engine

test01(id) values ( 1); ERROR 1030 (HY000): Got error - 1 from storage engine 求助, ERROR, error, from, storage ...
来自: 开发者社区 > 论坛 作者: 葵11 浏览:308 回复:5

greepplum "Interconnect encountered a network error, please check your network (seg1 slice1 机器

4673326,x52975354,sx 1," ERROR","58M01","Interconnect encountered a network error, please check your ...
来自: 开发者社区 > 问答 作者: 木莲00987 浏览:16 回复:1

[ERROR]java.lang.NullPointerException while starting TM1 10.1.1 Database Server

Technote (troubleshooting)Problem(Abstract)While starting TM 1 Database Server from TM 1 10. 1. 1 Cognos Configuration user ...
来自: 开发者社区 > 博客 作者: ghost丶桃子 浏览:478 回复:0

Error: Package: 1:nodejs-6.11.1-1.el7.x86_64 (epel)

.org//packages/http-parser/2.7. 1/3.el7/x86_64/http-parser-2.7. 1-3.el7.x86_64.rpmrpm -ivh&http-parser-2.7. 1-3.el7.x86_64 ...
来自: 开发者社区 > 博客 作者: 技术小胖子 浏览:7 回复:0

安装nagios3.3.1报错make[1]: *** [install] Error 1

/scripts'&make[ 1]:&***&[install]& Error& 1&make[ 1]:&Leaving&directory&`/root/nagios/html ...
来自: 开发者社区 > 博客 作者: wbf961127 浏览:11 回复:0

greepplum "Interconnect encountered a network error, please check your network (seg1 slice1

4673326,x52975354,sx 1," ERROR","58M01","Interconnect encountered a network error, please check your ...
来自: 开发者社区 > 问答 作者: 可_可 浏览:967 回复:0

我的Android进阶之旅------>解决Error:Could not find property 'compile' on org.gradle.api.internal.artifacts.

1错误描述解决方法 1错误原因2解决方法 1、错误描述刚刚,Android Studio突然编译不了了,报了如下错误: Error:Could not find property ...
来自: 开发者社区 > 博客 作者: 欧阳鹏 浏览:34 回复:0

使用resize API调整虚拟机配置后虚拟机状态变成error

在使用openstack的resize API修改虚拟机的配置的时候(这是 api:v 1. 1/{tenant_id}/servers/{server_id}/action),可以正确的往 api接口中发送post请求,也可以得到正确的响应,但是虚拟机状态却 ...
来自: 开发者社区 > 论坛 作者: 某县衙 浏览:224 回复:1

【COCOS2DX-LUA 脚本开发之十一】C/C++与LUA之间进行数据函数交互以及解决“PANIC: UNPROTECTED ERROR IN CALL TO LUA API (ATTEMPT TO INDEX A NIL VALUE)”的问题

这些交互时出现了如下错误: 1“PANIC: unprotected error in call to Lua API (attempt to index a nil value ...
来自: 开发者社区 > 博客 作者: ghost丶桃子 浏览:1102 回复:0

我的Android进阶之旅------>解决Error:Could not find property 'compile' on org.gradle.api.internal.artifacts.

1错误描述解决方法 1错误原因2解决方法 1、错误描述刚刚,Android Studio突然编译不了了,报了如下错误: Error:Could not find property ...
来自: 开发者社区 > 博客 作者: 欧阳鹏 浏览:34 回复:0

我的Android进阶之旅------>解决Error:Unable to find method 'org.gradle.api.internal.project.ProjectInternal.g

错误描述 今天在Github上面下载了一份代码,然后导入到Android Studio中直接报了如下图所示的错误: 错误描述如下: Error: Unable to find method ...
来自: 开发者社区 > 博客 作者: 欧阳鹏 浏览:33 回复:0

使用resize API调整虚拟机配置后虚拟机状态变成error

在使用openstack的resize API修改虚拟机的配置的时候(这是 api:v 1. 1/{tenant_id}/servers/{server_id}/action),可以正确的往 api接口中发送post请求,也可以得到正确的响应,但是虚拟机状态却 ...
来自: 开发者社区 > 论坛 作者: 某县衙 浏览:224 回复:1

WebIm API登陆报错 EASEMOB_IM_CONNCTION_OPEN_USERGRID_ERROR

我使用WebIm API进行用户登陆,报错 EASEMOB_IM_CONNCTION_OPEN_USERGRID_ ERROR var appKey = '这里是appkey' conn = new Easemob.im ...
来自: 开发者社区 > 论坛 作者: 懒洋洋我最爱 浏览:269 回复:0

Web API发布以后出现An error has occurred错误代码500

我做了个Web API,在本地调试是没问题的,但是发布到服务器以后出现一POST就出现{"Message":"An error has occurred"},用Fiddler4调试出现错误代码500,新手,求救命 Windows Server2016 [attachment=128486] [attachment=128487] ...
来自: 开发者社区 > 论坛 作者: larrywei 浏览:1168 回复:1

我做了一个Web API,调试没问题,但发布后出现An error has oc

我做了一个Web API,调试没问题,但发布后出现An error has occurred,错误代码是500,不知道要怎么弄,求救命,Windows Server2016![85cf 1a4d4bab4bf18f7849edde395f6d_ 1 ...
来自: 开发者社区 > 问答 作者: larrywei 浏览:144 回复:1

关于启动image提示Unexpected API Error.

各位大大: 小弟按照官网的配置教程搭建了openstack,但出现如上的问题: 错误:Unexpected API Error. Please report this at http://bugs.launchpad.net/nova/ and ...
来自: 开发者社区 > 论坛 作者: hyukd 浏览:272 回复:7

error: %preun(keepalived-1.2.7-3.el6.x86_64) scriptlet failed, exit status 1 解决

意见通过但 rpm -e keepalived 时,提示[root@lvs 1 ipvs]# rpm -e keepalived- 1.2.7 error reading information on service keepalived: No ...
来自: 开发者社区 > 博客 作者: 懂你 浏览:435 回复:0

update 8.1.5 to 8.1.7 遇到的 error

WIN2000, P3,ORACLE8. 1.5. 把8。 1。5 update 到8。 1。7后能够启动,但是出现如下的错误 信息: Error accessing package DBMS_APPLICATION_INFO ERROR: ORA-06553 ...
来自: 开发者社区 > 论坛 作者: 忧郁的白马 浏览:168 回复:1

-1,,dx41306158,x1385731 04,sx1,"ERROR","XX001","invalid page header in block 4545 of relation ""c

;192.168.206.10","13733",2016-09-01 10:26:45 CST,138573104,con324317,cmd13976,seg- 1,,dx41306158,x138573104,sx 1 ...
来自: 开发者社区 > 问答 作者: yazuo-yunwei 浏览:624 回复:2

Error:JDK1.8 Cannot change version of project facet Dynamic Web Module to 3.1.

问题: Error:JDK 1.8 Cannot change version of project facet Dynamic Web Module to 3. 1.此工程为名为mybatis:maven webapp project ...
来自: 开发者社区 > 博客 作者: tony~tian 浏览:1951 回复:0

安装EBS R12.1.1-error while loading shared libraries: libdb.so.2

log file. The error is very clear about the missing soft link. It would show this error:.../10. 1.3/Apache/Apache/bin ...
来自: 开发者社区 > 博客 作者: 机器的心脏 浏览:12 回复:0

ae83a_99ad_43dd_88ca_01c588904a1a:ODPS-1202005:Algo Job Failed-System Error-job runs failed:1. Please see the details in logview.

588904a 1a:ODPS-1202005:Algo Job Failed-System Error-job runs failed: 1. Please see the details in logview. ...
来自: 开发者社区 > 问答 作者: 祁同伟 浏览:325 回复:1

xcode编译报错unknown error -1=ffffffffffffffff Command /bin/sh failed with exit code 1

/Frameworks/AFHTTPRequestOperationLogger.framework: unknown error - 1=ffffffffffffffffCommand /bin/sh failed with exit code 1 ...
来自: 开发者社区 > 博客 作者: 嗯哼9925 浏览:8 回复:0

DataXceiver error processing unknown operation src: /127.0.0.1:36479 dst: /127.0.0.1:50010处理

;- hadoop07:50010:DataXceiver  error processingunknown operation  src: /127.0.0. 1:36479 dst ...
来自: 开发者社区 > 博客 作者: @dailidong@ 浏览:27 回复:0

oracle数据库提示Errors in file /export/ora2/admin/BIS1/udump/bis1_ora_13882.trc

不知道如何解决 查看13882.trc文件,内容如下: $ cat bis 1_ora_13882.trc /export/ora2/admin/BIS 1/udump/bis 1_ora_13882.trc Oracle Database 10g ...
来自: 开发者社区 > 论坛 作者: 丁丁果 浏览:201 回复:1

Error:java: javacTask: source release 1.6 requires target release 1.6

IDEA运行web项目时报错: Error:Java: javacTask: source release 1.6 requires target release 1.6解决方法:&& ...
来自: 开发者社区 > 博客 作者: 黄威的世界 浏览:900 回复:0

网站程序安装问题"_STORAGE_WRITE_ERROR_:./Application/Runtime/Cache/Install/c6bbce5b1f1dcf027c8ceb5cf5141b65.php

在上传网站程序后刚开始安装的时候出现如下提示:(_STORAGE_WRITE_ ERROR_:./Application/Runtime/Cache/Install/c6bbce5b 1f 1dcf027c8ceb5cf5141b65.php错误 ...
来自: 开发者社区 > 问答 作者: jason01 浏览:5352 回复:5

Blink streaming 不支持print(), 那为什么又有这样的api呢 val sql1 = "SELECT a, c FROM sourceTable"

转自钉钉群21789141:Blink streaming 不支持print(), 那为什么又有这样的 api呢 val sql 1 = "SELECT a, c FROM sourceTable" tEnv ...
来自: 开发者社区 > 问答 作者: 赵慧 浏览:10 回复:1

《UNIX网络编程 卷1:套接字联网API(第3版)》——第1章 简介 1.1概述

,daemon),它只在响应来自网络的请求时才发送网络消息。本节书摘来自异步社区《UNIX网络编程 卷 1:套接字联网 API(第3版)》一书中的第 1章,第 1. 1节,作者:【美】W. Richard Stevens , Bill Fenner , Andrew M ...
来自: 开发者社区 > 博客 作者: 异步社区 浏览:171 回复:0

容器服务集群创建常见错误

Config cs AcessRouting failed:Failed to CreateLoadBalancer:Aliyun <em>API</em> <em>Error</em>:RequestId:47AE<em>1</em>BFC-AFEA-469C-82F5-<em>1</em>E3...

使用CortexAPI 实现Cortex的基本操作

<em>API</em> provides bindings for Prometheus's v<em>1</em> <em>API</em>. type <em>API</em> interface { Alerts returns a list of all active alerts. A...

nginx忽略favicon.ico日志

2017/12/18 20:35:25[<em>error</em>]11955#0:*4176305 connect()failed(111:Connection refused)while connecting to upstream,client:10.0.40.167,server:<em...

Async/Await是这样简化JavaScript代码的

reject(new <em>Error</em>('Intentional <em>Error</em>')),200) }) } } 嵌套Promise function callbackHell(){ const <em>api</em>=new <em>Api</em>() let use...

ERROR (ClientException) nova image-list

ERROR(ClientException):Unexpected <em>API</em> <em>Error</em>.Please report this at http://bugs.launchpad.net/nova and attach the Nova API log if pos...

out/target/common/obj/PACKAGING/public_api.txt android.view.KeyEvent.KEYCODE_has changed value from

那么就 有分别以 <em>1</em>~15命名的xml或txt,就是<em>api</em> level)个xml或txt文档,分别对应android <em>api</em> 的不同版本。在这些xml中,把你在framework层中修改的地方对应进去。如我这个错误的地方,在15.txt 和 c...

7.2. web 服务器 ssl 证书

<em>error</em>_log/var/log/nginx/<em>api</em>.netkiller.cn.<em>error</em>.log;location/{ proxy_pass http://<em>api</em>.netkiller.cn;proxy_http_versi...

TensorFlow教程之API DOC 6.1.17 TensorFlow C++ Session API reference documentation

TensorFlow's public C++ <em>API</em> includes only the <em>API</em> for executing graphs,as of version 0.5.To control the execution of a graph from C...

Could not resolve dependencies for project

Jenkins服务 迁移到新机器后,项目无法完成下载,报错: ...Waiting for Jenkins to finish collecting data[<em>ERROR</em>]Failed to execute goal on project test-<em>api</em>:Co...

Business Transformation in the Age of the API

<em>1</em>.Private <em>API</em>:APIs used inside the enterprise.Private APIs link internal systems,mobile phone apps,and smart devices using standard...
< 1 2 3 4 ... 6398 >
共有6398页 跳转至: GO
产品推荐
短信服务 对象存储 API网关 云服务器 商标 SSL证书 轻量应用服务器
这些文档可能帮助您
如何在一分钟内发起压测? 对象存储 OSS-PutObject 人脸比对1:1 PTS使用指引 公安联网备案信息填写指南 计费说明总览

新品推荐

你可能感兴趣

热门推荐

新人福利专场 阿里云试用中心 企业支持计划 飞天会员助力企业低成本上云 智能财税30天免费试用 云解析DNS新用户首购低至36元/年起 ECS限时升级特惠6.5折